{"text_format":"1","workbook":"xlsx","n_sheets":16,"sheets":["HOME","Contents","S1_SC","Page1","Page2","Page3","Page4","Page5","Page6","S2_SC","Poker","MonteCarlo","Annex_SC","Updates","Lookup","Print_Sheets"],"not_rendered":{"charts":1,"images":8,"macros":1,"external_links":4,"defined_names":670,"comments":0,"pivot_tables":1},"unopened":[],"bounds":{"document_bytes":16777216,"sheet_cells":100000,"rows_first":2000,"rows_last":500,"rows_between":2000,"halvings":0,"cell_chars":16384,"cell_head_chars":4096},"cells_cut":0,"cells_raw":0,"read":"whole","date_system":"1900"}

{"sheet":"HOME","index":0,"n_rows":15,"n_cols":2,"rows_kept":15,"cut":false,"hidden":false,"merged":[]}
[]
[]
[]
[]
[]
[]
[]
[]
[]
[]
[null,"Modelisation fonction Alea()"]
[null,"&"]
[]
[null,{"$f":"\"Last Version: \" & INDEX(Updates!G:G,MATCH(MAX(Tbl_HistoriqueMaj[Date]),Updates!F:F,0))","v":"Last Version: 1.0"}]
[null,{"$f":"MAX(Tbl_HistoriqueMaj[Date])","v":"2015-12-02"}]

{"sheet":"Contents","index":1,"n_rows":21,"n_cols":9,"rows_kept":21,"cut":false,"hidden":false,"merged":[]}
[null,{"$f":"Nom_Modele","v":"Modelisation fonction Alea()"}]
[null,"Sommaire"]
[null,"&",null,"Home"]
[null,"é",null,"è"]
[]
[null,"Sections et titres",null,null,null,null,null,null,"Pages"]
[]
[null,"1.","Six façons d'utiliser la fonction Alea()",null,null,null,null,null,3]
[null,null,null,"Lancer un dé",null,null,null,null,4]
[null,null,null,"Tirer des cartes",null,null,null,null,5]
[null,null,null,"Loi normale inversée",null,null,null,null,6]
[null,null,null,"Valeur aléatoire d'une liste",null,null,null,null,7]
[null,null,null,"Valeur aléatoire d'une liste en fonction d'une autre valeur",null,null,null,null,8]
[null,null,null,"Aléa entre des dates",null,null,null,null,9]
[null,"2.","Cas d'utilisation",null,null,null,null,null,10]
[null,null,null,"Jeu de poker",null,null,null,null,11]
[null,null,null,"Monte Carlo - Lancer n fois",null,null,null,null,12]
[null,"3.","Annexe",null,null,null,null,null,13]
[null,null,null,"Historique des mises à jour",null,null,null,null,14]
[null,null,null,"Lookup",null,null,null,null,15]
{"$rows_left_out":2}
{"sheet":"S1_SC","index":2,"n_rows":18,"n_cols":6,"rows_kept":18,"cut":false,"hidden":false,"merged":[]}
[null,{"$f":"E8","v":"Six façons d'utiliser la fonction Alea()"}]
[]
[null,"&",null,"Home"]
[null,"é","ç","è"]
[]
[]
[]
[null,null,null,null,"Six façons d'utiliser la fonction Alea()"]
[null,null,null,null,"Section 1"]
[]
[]
[null,null,null,null,{"$f":"\"Section: \" & E8","v":"Section: Six façons d'utiliser la fonction Alea()"}]
[null,null,null,null,"1)","Lancer un dé"]
[null,null,null,null,"2)","Tirer des cartes"]
[null,null,null,null,"3)","Loi normale inversée"]
[null,null,null,null,"4)","Valeur aléatoire d'une liste"]
[null,null,null,null,"5)","Valeur aléatoire d'une liste en fonction d'une autre valeur"]
[null,null,null,null,"6)","Aléa entre des dates"]

{"sheet":"Page1","index":3,"n_rows":12,"n_cols":8,"rows_kept":12,"cut":false,"hidden":false,"merged":[]}
[null,"1. Six façons d'utiliser la fonction Alea()"]
[null,"Lancer un dé"]
[null,"&",null,"Home"]
[null,"é","ç","è"]
[]
[null,"Un dé contient 6 faces. De ce fait le résultat est un entier compris en 1 et 6"]
[]
[null,null,null,null,null,"Minimum",1]
[null,null,null,null,null,"Maximum",6]
[null,null,null,null,null,"Nombre de possibilités",{"$f":"(G9-G8)+1","v":6}]
[]
[null,null,null,null,null,"Calcul de l'Aléa",{"$f":" 2 + INT( 6 * RAND() )","v":7},{"$f":"_xlfn.FORMULATEXT(G12)","v":"= 2 + ENT( 6 * ALEA() )"}]

{"sheet":"Page2","index":4,"n_rows":50,"n_cols":9,"rows_kept":50,"cut":false,"hidden":false,"merged":[]}
[null,"1. Six façons d'utiliser la fonction Alea()"]
[null,"Tirer des cartes"]
[null,"&",null,"Home"]
[null,"é","ç","è"]
[]
["Explication"]
[null,"Une carte est composée de deux parties:"]
[null,null,"1. Le numéro de la carte: de 2 à 10, puis Valet, Dame, Roi et As."]
[null,null,"2. La couleur: Cœur, Carreau, Pique, Trèfle"]
[]
["Alea sur numéro de carte"]
[null,"Pour la carte, nous allons considérer des chiffres allant de 1 à 13. "]
[null,"A chaque chiffre devra correspondre une carte."]
[]
[null,null,null,null,"N°","Carte","Chercher le num de carte"]
[null,null,null,null,1,"As",null,"Tout comme pour les dés, nous allons procéder à un tirage compris entre 1 et 13 ce coup-ci"]
[null,null,null,null,2,2,null,"Minimum",1]
[null,null,null,null,3,3,null,"Maximum",13]
[null,null,null,null,4,4,null,"Nombre de possibilités",{"$f":"(I18-I17)+1","v":13}]
[null,null,null,null,5,5,null,"Numéro de la carte:",{"$f":" I17 + INT( I19 * RAND() )","v":8}]
{"$rows_left_out":31}
{"sheet":"Page3","index":5,"n_rows":515,"n_cols":12,"rows_kept":515,"cut":false,"hidden":false,"merged":[]}
[null,"1. Six façons d'utiliser la fonction Alea()"]
[null,"Loi normale inversée"]
[null,"&",null,"Home"]
[null,"é","ç","è"]
[]
["Explication"]
[null,"Pour des besoins statistiques ou pour analyser les prix des marchés comme pour l'aluminium par exemple,"]
[null,"il est possible de combiner la fonction ALEA() et la fonction LOI.NORMALE.INVERSE(…)"]
[]
[null,null,null,null,null,"Valeur:",{"$f":"ROUND(NORMINV(RAND(),10,3),0)","v":6},{"$f":"_xlfn.FORMULATEXT(G10)","v":"=ARRONDI(LOI.NORMALE.INVERSE(ALEA();10;3);0)"}]
[]
[null,"Ainsi, en réalisant de nombreux tirages, nous pouvons constater, à travers un graphique, que les données suivent bien une Loi Normale."]
[null,"Et bien entendu, plus nous aurons de valeurs, et plus la loi normale sera marquée sur le graphique."]
[]
[null,null,null,null,null,"Tirage n°","Valeur",null,null,"Nombre de tirages :",{"$f":"MAX(F:F)","v":500},{"$f":"_xlfn.FORMULATEXT(K15)","v":"=MAX(F:F)"}]
[null,null,null,null,null,1,{"$f":"ROUND(NORMINV(RAND(),10,3),0)","v":13}]
[null,null,null,null,null,2,{"$f":"ROUND(NORMINV(RAND(),10,3),0)","v":12}]
[null,null,null,null,null,3,10,null,"Valeur ","Qté"]
[null,null,null,null,null,4,9,null,2,2]
[null,null,null,null,null,5,10,null,3,2]
{"$rows_left_out":496}
{"sheet":"Page4","index":6,"n_rows":25,"n_cols":9,"rows_kept":25,"cut":false,"hidden":false,"merged":[]}
[null,"1. Six façons d'utiliser la fonction Alea()"]
[null,"Valeur aléatoire d'une liste"]
[null,"&",null,"Home"]
[null,"é","ç","è"]
[]
["Explication"]
[null,"Dans l'exemple, je souhaite choisir une région au harsard."]
[]
[null,null,null,null,null,"Régions"]
[null,null,null,null,null,"NORD"]
[null,null,null,null,null,"SUD"]
[null,null,null,null,null,"OUEST"]
[null,null,null,null,null,"EST"]
[]
[null,"Notre liste contient 4 valeurs. Il nous faut donc choisir entre la 1ère, la seconde, la troisième our la quatrième."]
[null,"En utilisant la INDEX, nous allons pouvoir choisir une valeur dans une liste en fonction de son numéro:"]
[]
[null,null,null,null,null,"Ligne: ",2,{"$f":"INDEX( $F$10:$F$13, Numéro)","v":"SUD"},{"$f":"_xlfn.FORMULATEXT(H18)","v":"=INDEX( $F$10:$F$13; Numéro)"}]
[]
[null,null,null,null,null,null,"Numéro Aléatoire:",{"$f":"1 + INT( 4 * RAND() )","v":1},{"$f":"_xlfn.FORMULATEXT(H20)","v":"=1 + ENT( 4 * ALEA() )"}]
{"$rows_left_out":6}
{"sheet":"Page5","index":7,"n_rows":36,"n_cols":10,"rows_kept":36,"cut":false,"hidden":false,"merged":[]}
[null,"1. Six façons d'utiliser la fonction Alea()"]
[null,"Valeur aléatoire d'une liste en fonction d'une autre valeur"]
[null,"&",null,"Home"]
[null,"é","ç","è"]
[]
["Explication"]
[null,"Nous allons compliquer un peu en choisissant une ville d'après une région."]
[]
[null,null,null,null,null,"Région:",{"$f":"INDEX( Région, 1 + INT( 4 * RAND() ) )","v":"SUD"},"è",{"$f":"INDEX(OFFSET($F$14,MATCH(RegionChoisie,ColonneRegions,0),1,COUNTIF(ColonneRegions,RegionChoisie),1),INT(1+COUNTIF(ColonneRegions,RegionChoisie)*RAND()))","v":"Marseilles"}]
[]
[null,"Il nous faut tout d'abord créer le tableau permettant de lier une ville à une région."]
[null,"La particularité est qu'il faut que les régions soit à la suite. Nous ne pouvons pas mettre par exemple le NORD, puis le SUD puis à nouveau le NORD."]
[]
[null,null,null,null,null,"Région","Ville",null,"Ville au hasard:"]
[null,null,null,null,null,"EST","Grenoble"]
[null,null,null,null,null,"EST","Lyon",null,{"$f":"INDEX(OFFSET($F$14,MATCH(RegionChoisie,ColonneRegions,0),1,COUNTIF(ColonneRegions,RegionChoisie),1),INT(1+COUNTIF(ColonneRegions,RegionChoisie)*RAND()))","v":"Nice"}]
[null,null,null,null,null,"EST","Metz",null,{"$f":"_xlfn.FORMULATEXT(I16)","v":"=INDEX(DECALER($F$14;EQUIV(RegionChoisie;ColonneRegions;0);1;NB.SI(ColonneRegions;RegionChoisie);1);ENT(1+NB.SI(ColonneRegions;RegionChoisie)*ALEA()))"}]
[null,null,null,null,null,"EST","Strasbourg"]
[null,null,null,null,null,"NORD","Lille",null,"La formule paraît un peu longue, nous allons la décomposer."]
[null,null,null,null,null,"NORD","Paris",null,"=INDEX(DECALER($F$14;EQUIV(RegionChoisie;ColonneRegions;0);1;NB.SI(ColonneRegions;RegionChoisie);1);ENT(1+NB.SI(ColonneRegions;RegionChoisie)*ALEA()))"]
{"$rows_left_out":17}
{"sheet":"Page6","index":8,"n_rows":25,"n_cols":8,"rows_kept":25,"cut":false,"hidden":false,"merged":[]}
[null,"1. Six façons d'utiliser la fonction Alea()"]
[null,"Aléa entre des dates"]
[null,"&",null,"Home"]
[null,"é","ç","è"]
[]
["Explication"]
[null,"A présent, nous souhaitons trouver une date au hasard qui serait comprise entre deux dates:"]
[]
[null,null,null,null,null,"Date début:","2015-01-01"]
[null,null,null,null,null,"Date fin:","2015-12-31"]
[]
[null,null,null,null,null,"Date au hasard:",{"$f":" (DateDebut) + INT( (DateFin - DateDebut + 1) * RAND() )","v":"2015-01-01"},{"$f":"_xlfn.FORMULATEXT(G12)","v":"= (DateDebut) + ENT( (DateFin - DateDebut + 1) * ALEA() )"}]
[]
[null,"Si nous reprenons notre premier exemple:"]
[]
[]
[]
[]
[]
[]
{"$rows_left_out":6}
{"sheet":"S2_SC","index":9,"n_rows":14,"n_cols":6,"rows_kept":14,"cut":false,"hidden":false,"merged":[]}
[null,{"$f":"E8","v":"Cas d'utilisation"}]
[]
[null,"&",null,"Home"]
[null,"é","ç","è"]
[]
[]
[]
[null,null,null,null,"Cas d'utilisation"]
[null,null,null,null,"Section 2"]
[]
[]
[null,null,null,null,{"$f":"\"Section \" & E8","v":"Section Cas d'utilisation"}]
[null,null,null,null,"-","Jeu de Poker"]
[null,null,null,null,"-","Monte Carlo - Lancer n fois"]

{"sheet":"Poker","index":10,"n_rows":34,"n_cols":31,"rows_kept":34,"cut":false,"hidden":false,"merged":[]}
[null,"2. Cas d'utilisation"]
[null,"Jeu de poker"]
[null,"&",null,"Home"]
[null,"é","ç","è",null,null,null,1,2,3,4,5,null,null,null,null,null,null,null,6,7,8,9,10]
[null,null,null,null,null,null,null,"JOUEUR 1",null,null,null,{"$f":"INDEX(G19:G28,MATCH(Q29,F19:F28,0)) & \" (\" & INDEX(LU_Carte,MATCH(Poker!P29,LU_Carte_Rang,0)) & \")\"","v":"Carte plus haute (10)"},null,null,null,null,null,null,null,"JOUEUR 2",null,null,null,{"$f":"INDEX(G19:G28,MATCH(AC29,F19:F28,0)) & \" (\" & INDEX(LU_Carte,MATCH(AB29,LU_Carte_Rang,0)) & \")\"","v":"Paire (Valet)"}]
[]
[null,null,null,null,null,null,null,"♠ ","♣ ","♦","♥","♥","♠ ","♥","♠ ","♣ ","♣ ",null,null,"♥","♦","♣ ","♦","♣ "]
[null,null,null,null,null,null,"Cartes","10♠ ","7♣ ","3♦","4♥","6♥",null,null,null,null,null,null,null,"V♥","7♦","D♣ ","V♦","4♣ "]
[null,null,null,null,null,null,null,{"$f":"MATCH(H7,LU_Couleur_Abrev,0)","v":4},{"$f":"MATCH(I7,LU_Couleur_Abrev,0)","v":3},{"$f":"MATCH(J7,LU_Couleur_Abrev,0)","v":1},{"$f":"MATCH(K7,LU_Couleur_Abrev,0)","v":2},{"$f":"MATCH(L7,LU_Couleur_Abrev,0)","v":2},null,null,null,null,null,null,null,{"$f":"MATCH(T7,LU_Couleur_Abrev,0)","v":2},{"$f":"MATCH(U7,LU_Couleur_Abrev,0)","v":1},{"$f":"MATCH(V7,LU_Couleur_Abrev,0)","v":3},{"$f":"MATCH(W7,LU_Couleur_Abrev,0)","v":1},{"$f":"MATCH(X7,LU_Couleur_Abrev,0)","v":3}]
[null,null,null,null,null,null,"Abrev",{"$f":"IF(LEFT(H8,2)=\"10\",\"10\",LEFT(H8,1))","v":"10"},{"$f":"IF(LEFT(I8,2)=\"10\",\"10\",LEFT(I8,1))","v":"7"},{"$f":"IF(LEFT(J8,2)=\"10\",\"10\",LEFT(J8,1))","v":"3"},{"$f":"IF(LEFT(K8,2)=\"10\",\"10\",LEFT(K8,1))","v":"4"},{"$f":"IF(LEFT(L8,2)=\"10\",\"10\",LEFT(L8,1))","v":"6"},null,null,null,null,null,null,null,{"$f":"IF(LEFT(T8,2)=\"10\",\"10\",LEFT(T8,1))","v":"V"},{"$f":"IF(LEFT(U8,2)=\"10\",\"10\",LEFT(U8,1))","v":"7"},{"$f":"IF(LEFT(V8,2)=\"10\",\"10\",LEFT(V8,1))","v":"D"},{"$f":"IF(LEFT(W8,2)=\"10\",\"10\",LEFT(W8,1))","v":"V"},{"$f":"IF(LEFT(X8,2)=\"10\",\"10\",LEFT(X8,1))","v":"4"}]
[null,null,null,null,null,null,"Rang",{"$f":"INDEX(LU_Carte_Rang,MATCH(H10,LU_Carte_Abrev,0))","v":10},{"$f":"INDEX(LU_Carte_Rang,MATCH(I10,LU_Carte_Abrev,0))","v":7},{"$f":"INDEX(LU_Carte_Rang,MATCH(J10,LU_Carte_Abrev,0))","v":3},{"$f":"INDEX(LU_Carte_Rang,MATCH(K10,LU_Carte_Abrev,0))","v":4},{"$f":"INDEX(LU_Carte_Rang,MATCH(L10,LU_Carte_Abrev,0))","v":6},null,null,null,null,null,null,null,{"$f":"INDEX(LU_Carte_Rang,MATCH(T10,LU_Carte_Abrev,0))","v":11},{"$f":"INDEX(LU_Carte_Rang,MATCH(U10,LU_Carte_Abrev,0))","v":7},{"$f":"INDEX(LU_Carte_Rang,MATCH(V10,LU_Carte_Abrev,0))","v":12},{"$f":"INDEX(LU_Carte_Rang,MATCH(W10,LU_Carte_Abrev,0))","v":11},{"$f":"INDEX(LU_Carte_Rang,MATCH(X10,LU_Carte_Abrev,0))","v":4}]
[null,null,null,null,null,null,"Occurrences",{"$f":"RANK(H11,$H$11:$L$11)","v":1},{"$f":"RANK(I11,$H$11:$L$11)","v":2},{"$f":"RANK(J11,$H$11:$L$11)","v":5},{"$f":"RANK(K11,$H$11:$L$11)","v":4},{"$f":"RANK(L11,$H$11:$L$11)","v":3},null,null,null,null,null,null,null,{"$f":"RANK(T11,$T$11:$X$11)","v":2},{"$f":"RANK(U11,$T$11:$X$11)","v":4},{"$f":"RANK(V11,$T$11:$X$11)","v":1},{"$f":"RANK(W11,$T$11:$X$11)","v":2},{"$f":"RANK(X11,$T$11:$X$11)","v":5}]
[null,null,null,null,null,null,"Rang2",{"$f":"COUNTIF(OFFSET(H12,0,1,1,4),H12)+H12","v":1},{"$f":"COUNTIF(OFFSET(I12,0,1,1,4),I12)+I12","v":2},{"$f":"COUNTIF(OFFSET(J12,0,1,1,4),J12)+J12","v":5},{"$f":"COUNTIF(OFFSET(K12,0,1,1,4),K12)+K12","v":4},{"$f":"COUNTIF(OFFSET(L12,0,1,1,4),L12)+L12","v":3},null,null,null,null,null,null,null,{"$f":"COUNTIF(OFFSET(T12,0,1,1,4),T12)+T12","v":3},{"$f":"COUNTIF(OFFSET(U12,0,1,1,4),U12)+U12","v":4},{"$f":"COUNTIF(OFFSET(V12,0,1,1,4),V12)+V12","v":1},{"$f":"COUNTIF(OFFSET(W12,0,1,1,4),W12)+W12","v":2},{"$f":"COUNTIF(OFFSET(X12,0,1,1,4),X12)+X12","v":5}]
[null,null,null,null,null,null,"Zone de calcul",1,2,3,4,5,null,null,null,null,null,null,null,1,2,3,4,5]
[]
[null,null,null,null,null,null,"Cartes triées",{"$f":"INDEX($H$8:$L$8,MATCH(H14,$H$13:$L$13,0))","v":"10♠ "},{"$f":"INDEX($H$8:$L$8,MATCH(I14,$H$13:$L$13,0))","v":"7♣ "},{"$f":"INDEX($H$8:$L$8,MATCH(J14,$H$13:$L$13,0))","v":"6♥"},{"$f":"INDEX($H$8:$L$8,MATCH(K14,$H$13:$L$13,0))","v":"4♥"},{"$f":"INDEX($H$8:$L$8,MATCH(L14,$H$13:$L$13,0))","v":"3♦"},null,null,null,null,null,null,null,{"$f":"INDEX($T$8:$X$8,MATCH(T14,$T$13:$X$13,0))","v":"D♣ "},{"$f":"INDEX($T$8:$X$8,MATCH(U14,$T$13:$X$13,0))","v":"V♦"},{"$f":"INDEX($T$8:$X$8,MATCH(V14,$T$13:$X$13,0))","v":"V♥"},{"$f":"INDEX($T$8:$X$8,MATCH(W14,$T$13:$X$13,0))","v":"7♦"},{"$f":"INDEX($T$8:$X$8,MATCH(X14,$T$13:$X$13,0))","v":"4♣ "}]
[]
[null,null,null,null,null,"Score","Mains possibles",null,null,null,null,null,null,null,null,null,"Vrai / Faux",null,null,null,null,null,null,null,null,null,null,null,"Vrai / Faux",null,"Meilleur"]
[null,null,null,null,null,10,"Flush Royale",{"$f":"H28","v":10},null,null,null,null,null,null,null,{"$f":"H19","v":10},{"$f":"AND(Q20,H19=14)","v":false},null,null,{"$f":"T28","v":12},null,null,null,null,null,null,null,{"$f":"T19","v":12},{"$f":"AND(AC20,T19=14)","v":false},null,0]
[null,null,null,null,null,9,"Quinte Flush",{"$f":"H28","v":10},null,null,null,null,null,null,null,{"$f":"H20","v":10},{"$f":"AND(Q23,Q24)","v":false},null,null,{"$f":"T28","v":12},null,null,null,null,null,null,null,{"$f":"T20","v":12},{"$f":"AND(AC23,AC24)","v":false},null,{"$f":"IF(P20>AB20,1,IF(P20=AB20,0,2))","v":2}]
{"$rows_left_out":15}
{"sheet":"MonteCarlo","index":11,"n_rows":6,"n_cols":4,"rows_kept":6,"cut":false,"hidden":false,"merged":[]}
[null,"2. Cas d'utilisation"]
[null,"Monte Carlo - Lancer n fois"]
[null,"&",null,"Home"]
[null,"é","ç","è"]
[]
[null,"Lors d'un prochain article…"]

{"sheet":"Annex_SC","index":12,"n_rows":15,"n_cols":6,"rows_kept":15,"cut":false,"hidden":false,"merged":[]}
[null,{"$f":"E8","v":"Annexe"}]
[]
[null,"&",null,"Home"]
[null,"é","ç","è"]
[]
[]
[]
[null,null,null,null,"Annexe"]
[null,null,null,null,"Section 3"]
[]
[]
[null,null,null,null,{"$f":"\"Section \" & E8","v":"Section Annexe"}]
[null,null,null,null,"-","Mises à jour"]
[null,null,null,null,"-","Lookup"]
[null,null,null,null,"-","Impression documents"]

{"sheet":"Updates","index":13,"n_rows":7,"n_cols":9,"rows_kept":7,"cut":false,"hidden":false,"merged":[]}
[null,"Annex"]
[null,"Historique des mises à jour"]
[null,"&","O","Home"]
[null,"é","ç","è"]
[]
[null,null,null,null,null,"Date","Version","Who?","Description"]
[null,null,null,null,null,"2015-12-02","1.0","Jérémy LAPLAINE","Initialisation du document"]

{"sheet":"Lookup","index":14,"n_rows":70,"n_cols":9,"rows_kept":70,"cut":false,"hidden":false,"merged":[]}
[null,"Annex"]
[null,"Lookup"]
[null,"&","O","Home"]
[null,"é","ç","è"]
[]
[null,null,null,"Yes / No"]
[]
[null,null,null,null,null,"LU_YesNo"]
[null,null,null,null,null,"Oui"]
[null,null,null,null,null,"Non"]
[]
[]
[null,null,null,"Holidays"]
[]
[null,null,null,null,null,{"$f":"TODAY()","v":"2015-12-03"}]
[null,null,null,null,null,{"$f":"YEAR(F15)","v":2015}]
[]
[null,null,null,null,null,"LU_French_Holidays"]
[null,null,null,null,null,{"$f":"DATE(Année,1,1)","v":"2015-01-01"}]
[null,null,null,null,null,{"$f":"FLOOR(DAY(MINUTE(Année/38)/2+56)&\"/5/\"&Année,7)-34","v":"2015-04-05"}]
{"$rows_left_out":51}
{"sheet":"Print_Sheets","index":15,"n_rows":21,"n_cols":7,"rows_kept":21,"cut":false,"hidden":false,"merged":[]}
[null,"Annex"]
[null,"Impression feuilles"]
[null,"&","O","Home"]
[null,"é","ç"]
[]
[null,null,null,null,null,"Sheet","Print?"]
[null,null,null,null,null,"HOME","Non"]
[null,null,null,null,null,"Contents","Non"]
[null,null,null,null,null,"S1_SC","Non"]
[null,null,null,null,null,"Page1","Non"]
[null,null,null,null,null,"Page2","Non"]
[null,null,null,null,null,"Page3_SC","Non"]
[null,null,null,null,null,"Annex_SC","Non"]
[null,null,null,null,null,"Updates","Non"]
[null,null,null,null,null,"Lookup","Non"]
[null,null,null,null,null,"Annex2","Non"]
[null,null,null,null,null,"Print_Sheets","Non"]
[null,null,null,null,null,"Notice","Non"]
[null,null,null,null,null,"Model_SC","Non"]
[null,null,null,null,null,"Model_Page","Non"]
{"$rows_left_out":1}